BDBM50155409 2-Hydroxy-xanthen-9-one::CHEMBL185960
SMILES Oc1ccc2oc3ccccc3c(=O)c2c1
InChI Key InChIKey=WSACHQJPCNOREV-UHFFFAOYSA-N
Data  2 IC50
  Tab Delimited (TSV)   2D SDfile   Computed 3D by Vconf -m prep SDfile
Find this compound or compounds like it in BindingDB:
Activity Spreadsheet -- Enzyme Inhibition Constant Data from BindingDB
Found 1 hit for monomerid = 50155409
TargetAmine oxidase [flavin-containing] A(Homo sapiens (Human))
Unne
Curated by ChEMBL
LigandPNGBDBM50155409(2-Hydroxy-xanthen-9-one | CHEMBL185960)
Affinity DataIC50:  3.80E+3nM. Assay description: Concentration required to inhibit monoamine oxidase activity by 50%
In DepthDetails ArticlePubMed